Reaction Details
TargetPlasma kallikrein
LigandBDBM306703
Substrate/Competitorn/a
Meas. Tech.In Vitro Plasma Kallikrein Inhibition Assay
IC50 1.000±n/a nM
Citation Li, ZZancanella, MYu, CSetti, LQSham, HXu, QYee, CWYu, M Bridged bicyclic kallikrein inhibitors US Patent US10144746 Publication Date 12/4/2018
 
Plasma kallikrein
Name:Plasma kallikrein
Type:Protein
Mol. Mass.:71391.16
Organism:Homo sapiens (Human)
Description:P03952
Residue:638
BDBM306703
NameBDBM306703
Synonyms:(1S,8R)-N-[(4- carbamimidoylphenyl) methyl]-11,12-diethyl- 15-oxatetracyclo [6.6.1.02,7.09,14] pentadeca- 2,4,6,9(14),10,12- hexaene-4-carboxamide | US10144746, Compound 392
TypeSmall organic molecule
Emp. Form.C27H27N3O2
Mol. Mass.425.5222
SMILESCCc1cc2[C@@H]3O[C@H](c2cc1CC)c1cc(ccc31)C(=O)NCc1ccc(cc1)C(N)=N