Reaction Details
TargetPlasma kallikrein
LigandBDBM306704
Substrate/Competitorn/a
Meas. Tech.In Vitro Plasma Kallikrein Inhibition Assay
IC50 5.01±n/a nM
Citation Li, ZZancanella, MYu, CSetti, LQSham, HXu, QYee, CWYu, M Bridged bicyclic kallikrein inhibitors US Patent US10144746 Publication Date 12/4/2018
 
Plasma kallikrein
Name:Plasma kallikrein
Type:Protein
Mol. Mass.:71391.16
Organism:Homo sapiens (Human)
Description:P03952
Residue:638
BDBM306704
NameBDBM306704
Synonyms:(+-)-N-[(4- carbamimidoylphenyl) methyl]-6-fluoro-12-(4- fluorophenyl)-10-methyl-15- oxatetracyclo[6.6.1.02,7.09,14] pentadeca- 2(7),3,5,9(14),10,12- hexaene-4-carboxamide | US10144746, Compound 396
TypeSmall organic molecule
Emp. Form.C30H23F2N3O2
Mol. Mass.495.5193
SMILESCc1cc(cc2C3OC(c12)c1c3cc(cc1F)C(=O)NCc1ccc(cc1)C(N)=N)-c1ccc(F)cc1