Reaction Details
TargetEstrogen receptor
LigandBDBM306756
Substrate/Competitorn/a
Meas. Tech.MCF-7 ER Down-Regulation Assay
IC50 0.079±n/a nM
Citation Scott, JSMoss, TAO Donovan, DHNissink, JWHughes, SJBarlaam, BCBroo, DAYang, BVarnes, JGWu, D Chemical compounds US Patent US10149839 Publication Date 12/11/2018
 
Estrogen receptor
Name:Estrogen receptor
Type:Protein
Mol. Mass.:66230.44
Organism:Homo sapiens (Human)
Description:P03372
Residue:595
BDBM306756
NameBDBM306756
Synonyms:N-(2-((5-((1R,3R)-2-(2,2-Difluoropropyl)-3-methyl-2,3,4,9-tetrahydro-1H-pyrido[3,4-b]indol-1-yl)-4-methoxypyridin-2-yl)oxy)ethyl)-3-fluoropropan-1-amine | US10149839, Example 42
TypeSmall organic molecule
Emp. Form.C26H33F3N4O2
Mol. Mass.490.561
SMILESCOc1cc(OCCNCCCF)ncc1[C@H]1N(CC(C)(F)F)[C@H](C)Cc2c1[nH]c1ccccc21