Reaction Details
TargetEstrogen receptor
LigandBDBM306764
Substrate/Competitorn/a
Meas. Tech.MCF-7 ER Down-Regulation Assay
IC50 0.087±n/a nM
Citation Scott, JSMoss, TAO Donovan, DHNissink, JWHughes, SJBarlaam, BCBroo, DAYang, BVarnes, JGWu, D Chemical compounds US Patent US10149839 Publication Date 12/11/2018
 
Estrogen receptor
Name:Estrogen receptor
Type:Protein
Mol. Mass.:66230.44
Organism:Homo sapiens (Human)
Description:P03372
Residue:595
BDBM306764
NameBDBM306764
Synonyms:BDBM306765 US10149839, Example 50
TypeSmall organic molecule
Emp. Form.C28H35F4N3O2
Mol. Mass.521.59
SMILESCOCC(C)(F)CN1[C@H](C)Cc2c([nH]c3ccccc23)[C@H]1c1c(F)cc(OCCNCCCF)cc1F