Reaction Details
TargetAcetyl-CoA carboxylase 2
LigandBDBM307025
Substrate/Competitorn/a
Meas. Tech.Inhibitory Activity on Human ACC1 and the ACC2
IC50 4.00±n/a nM
Citation Kobayashi, NAsahi, KTomida, YOhdan, MFumoto, MSasaki, YKurahashi, KInoue, TUrabe, TNishiura, YIwatsu, MMiyazaki, KOhyabu, NWada, TKatou, M Alkylene derivatives US Patent US10150728 Publication Date 12/11/2018
 
Acetyl-CoA carboxylase 2
Name:Acetyl-CoA carboxylase 2
Type:Protein
Mol. Mass.:276535.21
Organism:Homo sapiens (Human)
Description:O00763
Residue:2458
BDBM307025
NameBDBM307025
Synonyms:US10150728, Example I-238
TypeSmall organic molecule
Emp. Form.C20H26FN3O4S
Mol. Mass.423.502
SMILESC[C@@H](CO[C@H]1CC[C@@H](CC1)Oc1ncc2nc(OC3CC3)sc2c1F)NC(C)=O