Reaction Details
TargetAcetyl-CoA carboxylase 2
LigandBDBM307223
Substrate/Competitorn/a
Meas. Tech.Inhibitory Activity on Human ACC1 and the ACC2
IC50 4.00±n/a nM
Citation Kobayashi, NAsahi, KTomida, YOhdan, MFumoto, MSasaki, YKurahashi, KInoue, TUrabe, TNishiura, YIwatsu, MMiyazaki, KOhyabu, NWada, TKatou, M Alkylene derivatives US Patent US10150728 Publication Date 12/11/2018
 
Acetyl-CoA carboxylase 2
Name:Acetyl-CoA carboxylase 2
Type:Protein
Mol. Mass.:276535.21
Organism:Homo sapiens (Human)
Description:O00763
Residue:2458
BDBM307223
NameBDBM307223
Synonyms:US10150728, Example I-436
TypeSmall organic molecule
Emp. Form.C20H25ClN4O4
Mol. Mass.420.89
SMILESC[C@@H](CO[C@@H]1C[C@H](COc2ncnc(OCc3ccccn3)c2Cl)C1)NC(C)=O