Reaction Details
TargetGenome polyprotein
LigandBDBM307509
Substrate/Competitorn/a
Meas. Tech.HBsAg Assay
IC50 248±n/a nM
Citation Cheng, ZHan, XWang, YYang, S 6,7-dihydropyrido[2,1-A]phthalazin-2-ones for the treatment and prophylaxis of hepatitis B virus infection US Patent US10150740 Publication Date 12/11/2018
 
Genome polyprotein
Name:Genome polyprotein
Type:Protein
Mol. Mass.:327266.82
Organism:Hepatitis C virus (HCV)
Description:P26664
Residue:3011
BDBM307509
NameBDBM307509
Synonyms:US10150740, Example 5
TypeSmall organic molecule
Emp. Form.C19H22N2O5
Mol. Mass.358.3884
SMILESCOc1cc2CN(CC(C)C)n3cc(C(O)=O)c(=O)cc3-c2cc1OC