Reaction Details
TargetGenome polyprotein
LigandBDBM307519
Substrate/Competitorn/a
Meas. Tech.HBsAg Assay
IC50 500±n/a nM
Citation Cheng, ZHan, XWang, YYang, S 6,7-dihydropyrido[2,1-A]phthalazin-2-ones for the treatment and prophylaxis of hepatitis B virus infection US Patent US10150740 Publication Date 12/11/2018
 
Genome polyprotein
Name:Genome polyprotein
Type:Protein
Mol. Mass.:327266.82
Organism:Hepatitis C virus (HCV)
Description:P26664
Residue:3011
BDBM307519
NameBDBM307519
Synonyms:US10150740, Example 15
TypeSmall organic molecule
Emp. Form.C23H31N3O5
Mol. Mass.429.5093
SMILESCOc1cc-2c(CN(CC(C)C)n3cc(C(O)=O)c(=O)cc-23)cc1OCCCCCN