Reaction Details
TargetGenome polyprotein
LigandBDBM307547
Substrate/Competitorn/a
Meas. Tech.HCV Replicon Luciferase Assay
IC50 2.73±n/a nM
Citation Yeung, KKadow, JFBora, ROAnjanappa, PGupta, SV Compounds for the treatment of hepatitis C US Patent US10150747 Publication Date 12/11/2018
 
Genome polyprotein
Name:Genome polyprotein
Type:Enzyme
Mol. Mass.:326966.11
Organism:Hepatitis C virus (HCV)
Description:Q9WMX2
Residue:3010
BDBM307547
NameBDBM307547
Synonyms:BDBM307549 US10150747, Example 14
TypeSmall organic molecule
Emp. Form.C30H28FN5O6
Mol. Mass.573.5716
SMILESCCOc1cc2oc(c(C(=O)NC)c2cc1-c1cnc(OC)c(c1)C(=O)NC(C)(C)c1ncon1)-c1ccc(F)cc1