Reaction Details
TargetBeta-secretase 1 [1-460]
LigandBDBM307707
Substrate/Competitorn/a
Meas. Tech.TR-FRET Assay
IC50 37.0±n/a nM
Citation Minidis, ARahm, FViklund, J Mono-fluoro beta-secretase inhibitors US Patent US9650336 Publication Date 5/16/2017
 
Beta-secretase 1 [1-460]
Name:Beta-secretase 1 [1-460]
Type:Protein
Mol. Mass.:50987.78
Organism:Homo sapiens (Human)
Description:P56817[1-460]
Residue:460
BDBM307707
NameBDBM307707
Synonyms:4''-fluoro-6'-(3-fluoropropoxy)-4-[(2H3)methyloxy]-3'H-dispiro[cyclohexane-1,2'-indene-1',2''-pyrrol]-5''-amine | US9650336, Example 10
TypeSmall organic molecule
Emp. Form.C21H26F2N2O2
Mol. Mass.376.4401
SMILESCOC1CC[C@]2(Cc3ccc(OCCCF)cc3C22C=C(F)C(N)=N2)CC1