Reaction Details
TargetEnoyl-[acyl-carrier-protein] reductase [NADH] FabI
LigandBDBM8736
Substrate/CompetitorBDBM8737
Meas. Tech.Enzyme Inhibition Assay
pH6.5±n/a
Temperature303.15±n/a K
IC50<70±n/a nM
Citation Seefeld, MAMiller, WHNewlander, KABurgess, WJDeWolf, WEElkins, PAHead, MSJakas, DRJanson, CAKeller, PMManley, PJMoore, TDPayne, DJPearson, SPolizzi, BJQiu, XRittenhouse, SFUzinskas, INWallis, NGHuffman, WF Indole naphthyridinones as inhibitors of bacterial enoyl-ACP reductases FabI and FabK. J Med Chem46:1627-35 (2003) 
 
Enoyl-[acyl-carrier-protein] reductase [NADH] FabI
Name:Enoyl-[acyl-carrier-protein] reductase [NADH] FabI
Type:Enzyme
Mol. Mass.:27861.12
Organism:Escherichia coli
Description:n/a
Residue:262
BDBM8736
BDBM8737
NameBDBM8736
Synonyms:(2E)-N-methyl-3-(7-oxo-5,6,7,8-tetrahydro-1,8-naphthyridin-3-yl)-N-[(1,2,7-trimethyl-1H-indol-3-yl)methyl]prop-2-enamide indole naphthyridinone 32
TypeSmall organic molecule
Emp. Form.C24H26N4O2
Mol. Mass.402.4888
SMILESCN(Cc1c(C)n(C)c2c(C)cccc12)C(=O)\C=C\c1cnc2NC(=O)CCc2c1