Reaction Details
TargetEnoyl-[acyl-carrier-protein] reductase [NADH] FabI
LigandBDBM8748
Substrate/CompetitorBDBM8737
Meas. Tech.Enzyme Inhibition Assay
Temperature303.15±n/a K
IC50 1180±n/a nM
Commentsextracted
Citation Heerding, DAChan, GDeWolf, WEFosberry, APJanson, CAJaworski, DDMcManus, EMiller, WHMoore, TDPayne, DJQiu, XRittenhouse, SFSlater-Radosti, CSmith, WTakata, DTVaidya, KSYuan, CCHuffman, WF 1,4-Disubstituted imidazoles are potential antibacterial agents functioning as inhibitors of enoyl acyl carrier protein reductase (FabI). Bioorg Med Chem Lett11:2061-5 (2001) 
 
Enoyl-[acyl-carrier-protein] reductase [NADH] FabI
Name:Enoyl-[acyl-carrier-protein] reductase [NADH] FabI
Type:Enzyme
Mol. Mass.:27861.12
Organism:Escherichia coli
Description:n/a
Residue:262
BDBM8748
BDBM8737
NameBDBM8748
Synonyms:1-[(4-phenylphenyl)methyl]-4-(thiophen-3-yl)-1H-imidazole | Disubstituted imidazole 27
TypeSmall organic molecule
Emp. Form.C20H16N2S
Mol. Mass.316.419
SMILESC(c1ccc(cc1)-c1ccccc1)n1cnc(c1)-c1ccsc1