Reaction Details
TargetGlutaminyl-peptide cyclotransferase
LigandBDBM98187
Substrate/Competitorn/a
Meas. Tech.Fluorometric Assay
Ki 12.5±n/a nM
Citation Heiser, URamsbeck, DSommer, RMeyer, AHoffmann, TBoehme, LDemuth, H Inhibitors US Patent US9650362 Publication Date 5/16/2017
 
Glutaminyl-peptide cyclotransferase
Name:Glutaminyl-peptide cyclotransferase
Type:Enzyme
Mol. Mass.:40877.05
Organism:Homo sapiens (Human)
Description:Q16769
Residue:361
BDBM98187
NameBDBM98187
Synonyms:US8486940, 89 | US9650362, 89
TypeSmall organic molecule
Emp. Form.C26H25N5O2
Mol. Mass.439.509
SMILESO=C1OC[C@@H](N1c1ccc2nc[nH]c2c1)c1ccc(cc1)N1CCN(CC1)c1ccccc1