Reaction Details
TargetEnoyl-[acyl-carrier-protein] reductase [NADH] FabI
LigandBDBM8767
Substrate/CompetitorBDBM8737
Meas. Tech.Enzyme Inhibition Assay
Temperature303.15±n/a K
IC50 4200±n/a nM
Commentsextracted
Citation Seefeld, MAMiller, WHNewlander, KABurgess, WJPayne, DJRittenhouse, SFMoore, TDDeWolf, WEKeller, PMQiu, XJanson, CAVaidya, KFosberry, APSmyth, MGJaworski, DDSlater-Radosti, CHuffman, WF Inhibitors of bacterial enoyl acyl carrier protein reductase (FabI): 2,9-disubstituted 1,2,3,4-tetrahydropyrido[3,4-b]indoles as potential antibacterial agents. Bioorg Med Chem Lett11:2241-4 (2001) 
 
Enoyl-[acyl-carrier-protein] reductase [NADH] FabI
Name:Enoyl-[acyl-carrier-protein] reductase [NADH] FabI
Type:Enzyme
Mol. Mass.:27861.12
Organism:Escherichia coli
Description:n/a
Residue:262
BDBM8767
BDBM8737
NameBDBM8767
Synonyms:1,2,3,4-Tetrahydropyrido[3,4-b]indole 3 | 4-({9-[(4-hydroxyphenyl)methyl]-1H,2H,3H,4H,9H-pyrido[3,4-b]indol-2-yl}carbonyl)phenol
TypeSmall organic molecule
Emp. Form.C25H22N2O3
Mol. Mass.398.4538
SMILESOc1ccc(Cn2c3CN(CCc3c3ccccc23)C(=O)c2ccc(O)cc2)cc1