Reaction Details
TargetInterferon-induced, double-stranded RNA-activated protein kinase
LigandBDBM308049
Substrate/Competitorn/a
Meas. Tech.PDGFRβ Kinase Assay
Ki 727±n/a nM
Citation Boral, SMalone, TCWang, SRao, SYang, R Heterocycle-substituted pyridyl benzothiophenes as kinase inhibitors US Patent US9650366 Publication Date 5/16/2017
 
Interferon-induced, double-stranded RNA-activated protein kinase
Name:Interferon-induced, double-stranded RNA-activated protein kinase
Type:PROTEIN
Mol. Mass.:62104.61
Organism:Homo sapiens (Human)
Description:ChEMBL_1467743
Residue:551
BDBM308049
NameBDBM308049
Synonyms:US10011593, Ex. 1 | US9650366, 1
TypeSmall organic molecule
Emp. Form.C22H13ClF3N7OS
Mol. Mass.515.898
SMILESFC(F)(F)c1cc(NC(=O)Nc2ccc3sc(cc3c2)-c2cncc(c2)-c2nn[nH]n2)ccc1Cl