Reaction Details
TargetInterferon-induced, double-stranded RNA-activated protein kinase
LigandBDBM308054
Substrate/Competitorn/a
Meas. Tech.PDGFRβ Kinase Assay
Ki 99.0±n/a nM
Citation Boral, SMalone, TCWang, SRao, SYang, R Heterocycle-substituted pyridyl benzothiophenes as kinase inhibitors US Patent US9650366 Publication Date 5/16/2017
 
Interferon-induced, double-stranded RNA-activated protein kinase
Name:Interferon-induced, double-stranded RNA-activated protein kinase
Type:PROTEIN
Mol. Mass.:62104.61
Organism:Homo sapiens (Human)
Description:ChEMBL_1467743
Residue:551
BDBM308054
NameBDBM308054
Synonyms:US10011593, Ex. 4 | US9650366, 4
TypeSmall organic molecule
Emp. Form.C25H20F4N8O2S
Mol. Mass.572.537
SMILESNc1ncc(cc1-c1cc2cc(NC(=O)Nc3ccc(F)c(c3)C(F)(F)F)ccc2s1)-c1nnn(CCCO)n1