Reaction Details
TargetInterferon-induced, double-stranded RNA-activated protein kinase
LigandBDBM308056
Substrate/Competitorn/a
Meas. Tech.PDGFRβ Kinase Assay
Ki 66.0±n/a nM
Citation Boral, SMalone, TCWang, SRao, SYang, R Heterocycle-substituted pyridyl benzothiophenes as kinase inhibitors US Patent US9650366 Publication Date 5/16/2017
 
Interferon-induced, double-stranded RNA-activated protein kinase
Name:Interferon-induced, double-stranded RNA-activated protein kinase
Type:PROTEIN
Mol. Mass.:62104.61
Organism:Homo sapiens (Human)
Description:ChEMBL_1467743
Residue:551
BDBM308056
NameBDBM308056
Synonyms:US10011593, Ex. 6 | US9650366, 6
TypeSmall organic molecule
Emp. Form.C26H20F6N8O2S
Mol. Mass.622.545
SMILESNc1ncc(cc1-c1cc2cc(NC(=O)Nc3cc(cc(c3)C(F)(F)F)C(F)(F)F)ccc2s1)-c1nnn(CCCO)n1