Reaction Details
TargetVascular endothelial growth factor receptor 2
LigandBDBM308058
Substrate/Competitorn/a
Meas. Tech.VEGFR2 Kinase Assay
Ki 5.00±n/a nM
Citation Boral, SMalone, TCWang, SRao, SYang, R Heterocycle-substituted pyridyl benzothiophenes as kinase inhibitors US Patent US9650366 Publication Date 5/16/2017
 
Vascular endothelial growth factor receptor 2
Name:Vascular endothelial growth factor receptor 2
Type:Receptor Tyrosine Kinase
Mol. Mass.:151510.97
Organism:Homo sapiens (Human)
Description:P35968
Residue:1356
BDBM308058
NameBDBM308058
Synonyms:US10011593, Ex. 9 | US9650366, 9
TypeSmall organic molecule
Emp. Form.C23H20N6O3
Mol. Mass.428.4433
SMILESCc1ccoc1C(=O)Nc1cccc(c1)C#Cc1cncc(c1)-c1nnn(CCCO)n1