Reaction Details
TargetInterferon-induced, double-stranded RNA-activated protein kinase
LigandBDBM308058
Substrate/Competitorn/a
Meas. Tech.PDGFRβ Kinase Assay
Ki 10000±n/a nM
Citation Boral, SMalone, TCWang, SRao, SYang, R Heterocycle-substituted pyridyl benzothiophenes as kinase inhibitors US Patent US9650366 Publication Date 5/16/2017
 
Interferon-induced, double-stranded RNA-activated protein kinase
Name:Interferon-induced, double-stranded RNA-activated protein kinase
Type:PROTEIN
Mol. Mass.:62104.61
Organism:Homo sapiens (Human)
Description:ChEMBL_1467743
Residue:551
BDBM308058
NameBDBM308058
Synonyms:US10011593, Ex. 9 | US9650366, 9
TypeSmall organic molecule
Emp. Form.C23H20N6O3
Mol. Mass.428.4433
SMILESCc1ccoc1C(=O)Nc1cccc(c1)C#Cc1cncc(c1)-c1nnn(CCCO)n1