Reaction Details
TargetPlatelet-derived growth factor receptor beta
LigandBDBM308058
Substrate/Competitorn/a
Meas. Tech.PKR KinaseGlo Assay
Ki 21.0±n/a nM
Citation Boral, SMalone, TCWang, SRao, SYang, R Heterocycle-substituted pyridyl benzothiophenes as kinase inhibitors US Patent US9650366 Publication Date 5/16/2017
 
Platelet-derived growth factor receptor beta
Name:Platelet-derived growth factor receptor beta
Type:Enzyme
Mol. Mass.:123922.25
Organism:Homo sapiens (Human)
Description:P09619
Residue:1106
BDBM308058
NameBDBM308058
Synonyms:US10011593, Ex. 9 | US9650366, 9
TypeSmall organic molecule
Emp. Form.C23H20N6O3
Mol. Mass.428.4433
SMILESCc1ccoc1C(=O)Nc1cccc(c1)C#Cc1cncc(c1)-c1nnn(CCCO)n1