Reaction Details
TargetP2X purinoceptor 7
LigandBDBM173639
Substrate/Competitorn/a
Meas. Tech.In Vitro Assay
IC50 2.40±n/a nM
Citation Kilburn, JPRasmussen, LKJessing, MEldemenky, EMChen, BJiang, YHopper, AT Benzamide-containing compounds and their use in the treatment of pain US Patent US9649308 Publication Date 5/16/2017
 
P2X purinoceptor 7
Name:P2X purinoceptor 7
Type:Protein
Mol. Mass.:68602.85
Organism:Homo sapiens (Human)
Description:Q99572
Residue:595
BDBM173639
NameBDBM173639
Synonyms:US9102591, 2-Chloro-5-methyl-N-(1-methyl-4-phenyl-piperidin-4-ylmethyl)-benzamide | US9649308, 2-Chloro-5-methyl-N-(1-methyl-4-phenyl-piperidin-4-ylmethyl)-benzamide
TypeSmall organic molecule
Emp. Form.C21H25ClN2O
Mol. Mass.356.889
SMILESCN1CCC(CNC(=O)c2cc(C)ccc2Cl)(CC1)c1ccccc1