Reaction Details
TargetP2X purinoceptor 7
LigandBDBM173682
Substrate/Competitorn/a
Meas. Tech.In Vitro Assay
IC50 0.54±n/a nM
Citation Kilburn, JPRasmussen, LKJessing, MEldemenky, EMChen, BJiang, YHopper, AT Benzamide-containing compounds and their use in the treatment of pain US Patent US9649308 Publication Date 5/16/2017
 
P2X purinoceptor 7
Name:P2X purinoceptor 7
Type:Protein
Mol. Mass.:68602.85
Organism:Homo sapiens (Human)
Description:Q99572
Residue:595
BDBM173682
NameBDBM173682
Synonyms:US9102591, 2-chloro-N-((4,4-difluoro-1-(6-(trifluoromethyl)pyridin-3-yl)cyclohexyl)methyl)-3-methylbenzamide | US9649308, 2-chloro-N-((4,4-difluoro-1-(6-(trifluoromethyl)pyridin-3-yl)cyclohexyl)methyl)-3-methylbenzamide
TypeSmall organic molecule
Emp. Form.C21H20ClF5N2O
Mol. Mass.446.841
SMILESCc1cccc(C(=O)NCC2(CCC(F)(F)CC2)c2ccc(nc2)C(F)(F)F)c1Cl