Reaction Details
TargetP2X purinoceptor 7
LigandBDBM173710
Substrate/Competitorn/a
Meas. Tech.In Vitro Assay
IC50 0.88±n/a nM
Citation Kilburn, JPRasmussen, LKJessing, MEldemenky, EMChen, BJiang, YHopper, AT Benzamide-containing compounds and their use in the treatment of pain US Patent US9649308 Publication Date 5/16/2017
 
P2X purinoceptor 7
Name:P2X purinoceptor 7
Type:Protein
Mol. Mass.:68602.85
Organism:Homo sapiens (Human)
Description:Q99572
Residue:595
BDBM173710
NameBDBM173710
Synonyms:US9102591, (+)2,3-dichloro-N-[3-cyclopropyl-2-[2-(trifluoromethyl)pyrimidin-5-yl]propyl]benzamide US9102591, 2,3-dichloro-N-[3-cyclopropyl-2-[2-(trifluoromethyl)pyrimidin-5-yl]propyl]benzamide | US9649308, (+)2,3-dichloro-N-[3-cyclopropyl-2-[2-(trifluoromethyl)pyrimidin-5-yl]propyl]benzamide
TypeSmall organic molecule
Emp. Form.C18H16Cl2F3N3O
Mol. Mass.418.24
SMILESFC(F)(F)c1ncc(cn1)C(CNC(=O)c1cccc(Cl)c1Cl)CC1CC1