Reaction Details
TargetP2X purinoceptor 7
LigandBDBM173739
Substrate/Competitorn/a
Meas. Tech.In Vitro Assay
IC50 0.71±n/a nM
Citation Kilburn, JPRasmussen, LKJessing, MEldemenky, EMChen, BJiang, YHopper, AT Benzamide-containing compounds and their use in the treatment of pain US Patent US9649308 Publication Date 5/16/2017
 
P2X purinoceptor 7
Name:P2X purinoceptor 7
Type:Protein
Mol. Mass.:68602.85
Organism:Homo sapiens (Human)
Description:Q99572
Residue:595
BDBM173739
NameBDBM173739
Synonyms:US9102591, (+)2,6-dichloro-N-[3-cyclopropyl-2-[6-(trifluoromethyl)-3-pyridyl]propyl]benzamide US9102591, 2,6-dichloro-N-(3-cyclopropyl-2-(6-(trifluoromethyl)pyridin-3-yl)propyl)benzamide | US9649308, (+)2,6-dichloro-N-[3-cyclopropyl-2-[6-(trifluoromethyl)-3-pyridyl]propyl]benzamide
TypeSmall organic molecule
Emp. Form.C19H17Cl2F3N2O
Mol. Mass.417.252
SMILESFC(F)(F)c1ccc(cn1)C(CNC(=O)c1c(Cl)cccc1Cl)CC1CC1