Reaction Details
TargetP2X purinoceptor 7
LigandBDBM173820
Substrate/Competitorn/a
Meas. Tech.In Vitro Assay
IC50 2.20±n/a nM
Citation Kilburn, JPRasmussen, LKJessing, MEldemenky, EMChen, BJiang, YHopper, AT Benzamide-containing compounds and their use in the treatment of pain US Patent US9649308 Publication Date 5/16/2017
 
P2X purinoceptor 7
Name:P2X purinoceptor 7
Type:Protein
Mol. Mass.:68602.85
Organism:Homo sapiens (Human)
Description:Q99572
Residue:595
BDBM173820
NameBDBM173820
Synonyms:US9102591, (+)2-chloro-N-[2-(4-fluorophenyl)-2-[6-(trifluoromethyl)-3-pyridyl]ethyl]benzamide US9649308, (-)2-chloro-N-[2-(4-fluorophenyl)-2-[6-(trifluoromethyl)-3-pyridyl]ethyl]benzamide
TypeSmall organic molecule
Emp. Form.C21H15ClF4N2O
Mol. Mass.422.803
SMILESFc1ccc(cc1)C(CNC(=O)c1ccccc1Cl)c1ccc(nc1)C(F)(F)F