Reaction Details
TargetTyrosine-protein kinase Mer
LigandBDBM308182
Substrate/Competitorn/a
Meas. Tech.Activity Assay
IC50 1.10±n/a nM
Citation Wang, XZhang, WFrye, S Therapeutic uses of selected pyrimidine compounds with anti-Mer tyrosine kinase activity US Patent US9649309 Publication Date 5/16/2017
 
Tyrosine-protein kinase Mer
Name:Tyrosine-protein kinase Mer
Type:PROTEIN
Mol. Mass.:110234.77
Organism:Homo sapiens (Human)
Description:ChEMBL_1498723
Residue:999
BDBM308182
NameBDBM308182
Synonyms:US9649309, Compound UNC2422A
TypeSmall organic molecule
Emp. Form.C25H36F2N6O
Mol. Mass.474.5897
SMILESCCCCNc1ncc(c(NC2CC[C@H](O)CC2)n1)-c1ccc(CN2CCC(F)(F)CC2)cn1