Reaction Details
TargetTyrosine-protein kinase Mer
LigandBDBM308318
Substrate/Competitorn/a
Meas. Tech.Activity Assay
IC50 0.610±n/a nM
Citation Wang, XZhang, WFrye, S Therapeutic uses of selected pyrimidine compounds with anti-Mer tyrosine kinase activity US Patent US9649309 Publication Date 5/16/2017
 
Tyrosine-protein kinase Mer
Name:Tyrosine-protein kinase Mer
Type:PROTEIN
Mol. Mass.:110234.77
Organism:Homo sapiens (Human)
Description:ChEMBL_1498723
Residue:999
BDBM308318
NameBDBM308318
Synonyms:US9649309, Compound UNC3667A
TypeSmall organic molecule
Emp. Form.C28H42N6O2
Mol. Mass.494.6721
SMILESCCCCNc1ncc(c(NC2CCC(O)CC2)n1)-c1ccc(cn1)C1(CCCC1)N1CCOCC1