Reaction Details
TargetTyrosine-protein kinase Mer
LigandBDBM308339
Substrate/Competitorn/a
Meas. Tech.Activity Assay
IC50 1.30±n/a nM
Citation Wang, XZhang, WFrye, S Therapeutic uses of selected pyrimidine compounds with anti-Mer tyrosine kinase activity US Patent US9649309 Publication Date 5/16/2017
 
Tyrosine-protein kinase Mer
Name:Tyrosine-protein kinase Mer
Type:PROTEIN
Mol. Mass.:110234.77
Organism:Homo sapiens (Human)
Description:ChEMBL_1498723
Residue:999
BDBM308339
NameBDBM308339
Synonyms:US9649309, Compound UNC4372A
TypeSmall organic molecule
Emp. Form.C27H31N7O
Mol. Mass.469.5813
SMILESO[C@H]1CC[C@@H](CC1)Nc1nc(Nc2ccc(cc2)[N+]#[C-])ncc1-c1ccc(CN2CCCC2)cn1