Reaction Details
TargetTyrosine-protein kinase receptor TYRO3
LigandBDBM308339
Substrate/Competitorn/a
Meas. Tech.Activity Assay
IC50 3.90±n/a nM
Citation Wang, XZhang, WFrye, S Therapeutic uses of selected pyrimidine compounds with anti-Mer tyrosine kinase activity US Patent US9649309 Publication Date 5/16/2017
 
Tyrosine-protein kinase receptor TYRO3
Name:Tyrosine-protein kinase receptor TYRO3
Type:Protein
Mol. Mass.:96894.13
Organism:Homo sapiens (Human)
Description:Q06418
Residue:890
BDBM308339
NameBDBM308339
Synonyms:US9649309, Compound UNC4372A
TypeSmall organic molecule
Emp. Form.C27H31N7O
Mol. Mass.469.5813
SMILESO[C@H]1CC[C@@H](CC1)Nc1nc(Nc2ccc(cc2)[N+]#[C-])ncc1-c1ccc(CN2CCCC2)cn1