Reaction Details
TargetTyrosine-protein kinase Mer
LigandBDBM308349
Substrate/Competitorn/a
Meas. Tech.Activity Assay
IC50 0.670±n/a nM
Citation Wang, XZhang, WFrye, S Therapeutic uses of selected pyrimidine compounds with anti-Mer tyrosine kinase activity US Patent US9649309 Publication Date 5/16/2017
 
Tyrosine-protein kinase Mer
Name:Tyrosine-protein kinase Mer
Type:PROTEIN
Mol. Mass.:110234.77
Organism:Homo sapiens (Human)
Description:ChEMBL_1498723
Residue:999
BDBM308349
NameBDBM308349
Synonyms:US9649309, Compound UNC4160A
TypeSmall organic molecule
Emp. Form.C24H38N6O
Mol. Mass.426.5981
SMILESCCCCNc1ncc(c(N[C@H]2CC[C@H](O)CC2)n1)-c1ccc(CNC(C)(C)C)cn1