Reaction Details
TargetTyrosine-protein kinase Mer
LigandBDBM308354
Substrate/Competitorn/a
Meas. Tech.Activity Assay
IC50 0.810±n/a nM
Citation Wang, XZhang, WFrye, S Therapeutic uses of selected pyrimidine compounds with anti-Mer tyrosine kinase activity US Patent US9649309 Publication Date 5/16/2017
 
Tyrosine-protein kinase Mer
Name:Tyrosine-protein kinase Mer
Type:PROTEIN
Mol. Mass.:110234.77
Organism:Homo sapiens (Human)
Description:ChEMBL_1498723
Residue:999
BDBM308354
NameBDBM308354
Synonyms:US9649309, Compound UNC4169A
TypeSmall organic molecule
Emp. Form.C27H40N6O
Mol. Mass.464.6461
SMILESCCCCNc1ncc(c(N[C@H]2CC[C@H](O)CC2)n1)-c1ccc(CN2C3CCC2CCC3)cn1