Reaction Details
TargetTyrosine-protein kinase receptor TYRO3
LigandBDBM308367
Substrate/Competitorn/a
Meas. Tech.Activity Assay
IC50 27.0±n/a nM
Citation Wang, XZhang, WFrye, S Therapeutic uses of selected pyrimidine compounds with anti-Mer tyrosine kinase activity US Patent US9649309 Publication Date 5/16/2017
 
Tyrosine-protein kinase receptor TYRO3
Name:Tyrosine-protein kinase receptor TYRO3
Type:Protein
Mol. Mass.:96894.13
Organism:Homo sapiens (Human)
Description:Q06418
Residue:890
BDBM308367
NameBDBM308367
Synonyms:US9649309, Compound UNC4354A
TypeSmall organic molecule
Emp. Form.C24H34N6O
Mol. Mass.422.5664
SMILESCCCCNc1ncc(c(N[C@H]2CC[C@H](O)CC2)n1)-c1ccc(cn1)C1=CCNCC1