Reaction Details
TargetTyrosine-protein kinase Mer
LigandBDBM50444241
Substrate/Competitorn/a
Meas. Tech.Activity Assay
IC50<10±n/a nM
Citation Wang, XZhang, WFrye, S Therapeutic uses of selected pyrimidine compounds with anti-Mer tyrosine kinase activity US Patent US9649309 Publication Date 5/16/2017
 
Tyrosine-protein kinase Mer
Name:Tyrosine-protein kinase Mer
Type:PROTEIN
Mol. Mass.:110234.77
Organism:Homo sapiens (Human)
Description:ChEMBL_1498723
Residue:999
BDBM50444241
NameBDBM50444241
Synonyms:CHEMBL3093756 | US9649309, Compound UNC2881A
TypeSmall organic molecule
Emp. Form.C25H33N7O2
Mol. Mass.463.5752
SMILESCCCCNc1ncc(C(=O)NCc2ccc(cc2)-n2ccnc2)c(N[C@H]2CC[C@H](O)CC2)n1