Reaction Details
TargetEnteropeptidase
LigandBDBM308550
Substrate/Competitorn/a
Meas. Tech.Inhibitory Activity Assay
Ki 0.240±n/a nM
Citation Koshiba, TTokumasu, MIchimaru, TOhsumi, KNakagawa, TYamada, TMatsumoto, KSuzuki, T Heteroarylcarboxylic acid ester derivative US Patent US9655879 Publication Date 5/23/2017
 
Enteropeptidase
Name:Enteropeptidase
Type:Enzyme
Mol. Mass.:112901.62
Organism:Homo sapiens (Human)
Description:P98073
Residue:1019
BDBM308550
NameBDBM308550
Synonyms:US9655879, 86
TypeSmall organic molecule
Emp. Form.C23H27ClFN7O5S
Mol. Mass.568.021
SMILESCl.CCC(CC)(Cc1ccc(s1)C(=O)Oc1ccc(cc1F)C(N)=N)C(=O)N[C@@H](Cc1nn[nH]n1)C(O)=O