Reaction Details
TargetEnteropeptidase
LigandBDBM308557
Substrate/Competitorn/a
Meas. Tech.Inhibitory Activity Assay
Ki 0.300±n/a nM
Citation Koshiba, TTokumasu, MIchimaru, TOhsumi, KNakagawa, TYamada, TMatsumoto, KSuzuki, T Heteroarylcarboxylic acid ester derivative US Patent US9655879 Publication Date 5/23/2017
 
Enteropeptidase
Name:Enteropeptidase
Type:Enzyme
Mol. Mass.:112901.62
Organism:Homo sapiens (Human)
Description:P98073
Residue:1019
BDBM308557
NameBDBM308557
Synonyms:US9655879, 93
TypeSmall organic molecule
Emp. Form.C22H25ClFN3O6S
Mol. Mass.513.967
SMILESCl.CC(C)(Cc1ccc(s1)C(=O)Oc1ccc(cc1F)C(N)=N)C(=O)N1C[C@H](O)C[C@H]1C(O)=O