Reaction Details
TargetAlpha-1,3-mannosyl-glycoprotein 2-beta-N-acetylglucosaminyltransferase
LigandBDBM308582
Substrate/Competitorn/a
Meas. Tech.Radioligand Binding Assay
Ki<10.00±n/a nM
Citation Amberg, WPohlki, FLange, UWang, YXZhao, HHLi, HBrewer, JTZanze, IDietrich, JVasudevan, ADjuric, SWLao, YHutchins, CW Pyrrolidine derivatives, pharmaceutical compositions containing them, and their use in therapy US Patent US9656955 Publication Date 5/23/2017
 
Alpha-1,3-mannosyl-glycoprotein 2-beta-N-acetylglucosaminyltransferase
Name:Alpha-1,3-mannosyl-glycoprotein 2-beta-N-acetylglucosaminyltransferase
Type:PROTEIN
Mol. Mass.:50891.32
Organism:Homo sapiens (Human)
Description:ChEMBL_107587
Residue:445
BDBM308582
NameBDBM308582
Synonyms:US9656955, Example 67 | trans-1-[(1-methyl-1H-imidazol-4-yl)sulfonyl]-4-phenyl-N-[3-(trifluoromethyl)phenyl]pyrrolidin-3-amine
TypeSmall Organic Molecule
Emp. Form.C21H21F3N4O2S
Mol. Mass.450.477
SMILESCn1cnc(c1)S(=O)(=O)N1C[C@@H](Nc2cccc(c2)C(F)(F)F)[C@@H](C1)c1ccccc1