Reaction Details
TargetAlpha-1,3-mannosyl-glycoprotein 2-beta-N-acetylglucosaminyltransferase
LigandBDBM308748
Substrate/Competitorn/a
Meas. Tech.Radioligand Binding Assay
Ki<10.00±n/a nM
Citation Amberg, WPohlki, FLange, UWang, YXZhao, HHLi, HBrewer, JTZanze, IDietrich, JVasudevan, ADjuric, SWLao, YHutchins, CW Pyrrolidine derivatives, pharmaceutical compositions containing them, and their use in therapy US Patent US9656955 Publication Date 5/23/2017
 
Alpha-1,3-mannosyl-glycoprotein 2-beta-N-acetylglucosaminyltransferase
Name:Alpha-1,3-mannosyl-glycoprotein 2-beta-N-acetylglucosaminyltransferase
Type:PROTEIN
Mol. Mass.:50891.32
Organism:Homo sapiens (Human)
Description:ChEMBL_107587
Residue:445
BDBM308748
NameBDBM308748
Synonyms:US9656955, Example 262 | trans-N-(4-chlorobenzyl)-4-(4-fluorophenyl)-1-[(1-methyl-1H-imidazol-4-yl)sulfonyl]pyrrolidin-3-amine
TypeSmall Organic Molecule
Emp. Form.C21H22ClFN4O2S
Mol. Mass.448.941
SMILESCn1cnc(c1)S(=O)(=O)N1C[C@@H](NCc2ccc(Cl)cc2)[C@@H](C1)c1ccc(F)cc1