Reaction Details
TargetSodium channel protein type 9 subunit alpha
LigandBDBM50393018
Substrate/Competitorn/a
Meas. Tech.Electrophysiology Assay
Ki 59.0±10 nM
Citation Ni, CPark, MShao, BTafesse, LYao, JYoungman, MAZhou, X Substituted pyridines as sodium channel blockers US Patent US9656959 Publication Date 5/23/2017
 
Sodium channel protein type 9 subunit alpha
Name:Sodium channel protein type 9 subunit alpha
Type:Protein
Mol. Mass.:226375.97
Organism:Homo sapiens (Human)
Description:Q15858
Residue:1988
BDBM50393018
NameBDBM50393018
Synonyms:CHEMBL2152683 | US9656959, Example 7
TypeSmall organic molecule
Emp. Form.C29H27FN4O3
Mol. Mass.498.5481
SMILESCC(C)C[C@H](NC(=O)c1ccccn1)C(=O)Nc1cccc(n1)-c1ccc(Oc2ccc(F)cc2)cc1