Reaction Details
TargetMu-type opioid receptor
LigandBDBM309330
Substrate/Competitorn/a
Meas. Tech.Opioid Receptor Binding Assay
Ki 0.079±n/a nM
Citation Blumberg, LCDeaver, DREyerman, DJWynn, TA Methods for treating depressive symptoms US Patent US9656961 Publication Date 5/23/2017
 
Mu-type opioid receptor
Name:Mu-type opioid receptor
Type:G Protein-Coupled Receptor (GPCR)
Mol. Mass.:44789.51
Organism:Homo sapiens (Human)
Description:P35372
Residue:400
BDBM309330
NameBDBM309330
Synonyms:US10231963, Table B.2 US9656961, Example 00119
TypeSmall organic molecule
Emp. Form.C21H29NO
Mol. Mass.311.4611
SMILESC[C@H](C1CC1)N1CC[C@]23CCCC[C@H]2[C@H]1Cc1ccc(O)cc31