Reaction Details
TargetMu-type opioid receptor
LigandBDBM179879
Substrate/Competitorn/a
Meas. Tech.Opioid Receptor Binding Assay
IC50 3.70±n/a nM
Citation Blumberg, LCDeaver, DREyerman, DJWynn, TA Methods for treating depressive symptoms US Patent US9656961 Publication Date 5/23/2017
 
Mu-type opioid receptor
Name:Mu-type opioid receptor
Type:G Protein-Coupled Receptor (GPCR)
Mol. Mass.:44789.51
Organism:Homo sapiens (Human)
Description:P35372
Residue:400
BDBM179879
NameBDBM179879
Synonyms:US10231963, Table B.25 US10736890, Compound TABLE B.25 US11534436, Compound Table B.25 US9656961, Example 00142
TypeSmall organic molecule
Emp. Form.C22H30N2O3
Mol. Mass.370.4852
SMILESNC(=O)c1ccc2C[C@@H]3[C@@H]4CC[C@@H](O)C[C@]4(CCN3CC3CCC3)c2c1O