Reaction Details
TargetMu-type opioid receptor
LigandBDBM179883
Substrate/Competitorn/a
Meas. Tech.Opioid Receptor Binding Assay
EC50 2.30±n/a nM
Citation Blumberg, LCDeaver, DREyerman, DJWynn, TA Methods for treating depressive symptoms US Patent US9656961 Publication Date 5/23/2017
 
Mu-type opioid receptor
Name:Mu-type opioid receptor
Type:G Protein-Coupled Receptor (GPCR)
Mol. Mass.:44789.51
Organism:Homo sapiens (Human)
Description:P35372
Residue:400
BDBM179883
NameBDBM179883
Synonyms:US10287250, Example 00074 US9133125, Table C, Compound 1 | US9656961, Example 00145
TypeSmall organic molecule
Emp. Form.C19H27NO
Mol. Mass.285.4238
SMILESC[C@H](C1CC1)N1CC[C@@]2(C)C(C)[C@H]1Cc1ccc(O)cc21