Reaction Details
TargetMu-type opioid receptor
LigandBDBM309431
Substrate/Competitorn/a
Meas. Tech.Opioid Receptor Binding Assay
Ki 2.10±n/a nM
Citation Blumberg, LCDeaver, DREyerman, DJWynn, TA Methods for treating depressive symptoms US Patent US9656961 Publication Date 5/23/2017
 
Mu-type opioid receptor
Name:Mu-type opioid receptor
Type:G Protein-Coupled Receptor (GPCR)
Mol. Mass.:44789.51
Organism:Homo sapiens (Human)
Description:P35372
Residue:400
BDBM309431
NameBDBM309431
Synonyms:US9656961, Example 00151
TypeSmall organic molecule
Emp. Form.C20H28N2O
Mol. Mass.312.4491
SMILES[#6]-[#6]1-[#6@H]-2-[#6]-c3ccc(cc3[C@@]1([#6])[#6]-[#6]-[#7]-2-[#6]\[#6]=[#6](\[#6])-[#6])-[#6](-[#7])=O