Reaction Details
TargetMu-type opioid receptor
LigandBDBM179887
Substrate/Competitorn/a
Meas. Tech.Opioid Receptor Binding Assay
Ki 0.110±n/a nM
Citation Blumberg, LCDeaver, DREyerman, DJWynn, TA Methods for treating depressive symptoms US Patent US9656961 Publication Date 5/23/2017
 
Mu-type opioid receptor
Name:Mu-type opioid receptor
Type:G Protein-Coupled Receptor (GPCR)
Mol. Mass.:44789.51
Organism:Homo sapiens (Human)
Description:P35372
Residue:400
BDBM179887
NameBDBM179887
Synonyms:US10287250, Compound C.5 US9133125, Table C, Compound 5 | US9656961, Example 00152
TypeSmall organic molecule
Emp. Form.C17H25NO2
Mol. Mass.275.3859
SMILESCOCCN1CC[C@]2(C)[C@@H](C)[C@H]1Cc1ccc(O)cc21