Reaction Details
TargetMu-type opioid receptor
LigandBDBM309435
Substrate/Competitorn/a
Meas. Tech.Opioid Receptor Binding Assay
Ki 0.300±n/a nM
Citation Blumberg, LCDeaver, DREyerman, DJWynn, TA Methods for treating depressive symptoms US Patent US9656961 Publication Date 5/23/2017
 
Mu-type opioid receptor
Name:Mu-type opioid receptor
Type:G Protein-Coupled Receptor (GPCR)
Mol. Mass.:44789.51
Organism:Homo sapiens (Human)
Description:P35372
Residue:400
BDBM309435
NameBDBM309435
Synonyms:US9656961, Example 00155
TypeSmall organic molecule
Emp. Form.C34H40N2O2
Mol. Mass.508.6936
SMILESCOc1cccc(c1)-c1ccc(CCNC(=O)c2ccc3C[C@@H]4[C@H](C)[C@](C)(CCN4CC4CC4)c3c2)cc1