Reaction Details
TargetMu-type opioid receptor
LigandBDBM179892
Substrate/Competitorn/a
Meas. Tech.Opioid Receptor Binding Assay
Ki 3.00±n/a nM
Citation Blumberg, LCDeaver, DREyerman, DJWynn, TA Methods for treating depressive symptoms US Patent US9656961 Publication Date 5/23/2017
 
Mu-type opioid receptor
Name:Mu-type opioid receptor
Type:G Protein-Coupled Receptor (GPCR)
Mol. Mass.:44789.51
Organism:Homo sapiens (Human)
Description:P35372
Residue:400
BDBM179892
NameBDBM179892
Synonyms:US10287250, Compound C.11 US9133125, Table C, Compound 10 US9656961, Example 00161
TypeSmall organic molecule
Emp. Form.C17H24N2O
Mol. Mass.272.3853
SMILESC[C@@]12CCCCC[C@@H](Cc3ccc(cc13)C(N)=O)[C@@H]2N