Reaction Details
TargetMu-type opioid receptor
LigandBDBM179896
Substrate/Competitorn/a
Meas. Tech.Opioid Receptor Binding Assay
Ki 1.20±n/a nM
Citation Blumberg, LCDeaver, DREyerman, DJWynn, TA Methods for treating depressive symptoms US Patent US9656961 Publication Date 5/23/2017
 
Mu-type opioid receptor
Name:Mu-type opioid receptor
Type:G Protein-Coupled Receptor (GPCR)
Mol. Mass.:44789.51
Organism:Homo sapiens (Human)
Description:P35372
Residue:400
BDBM179896
NameBDBM179896
Synonyms:US10287250, Compound C.14 US9133125, Table C, Compound 14 | US9656961, Example 00164
TypeSmall organic molecule
Emp. Form.C20H28N2O
Mol. Mass.312.4491
SMILESCC1C2Cc3ccc(cc3[C@]1(C)CCN2CC1(C)CC1)C(N)=O