Reaction Details
TargetHistone deacetylase 1/11/4/6/8
LigandBDBM65472
Substrate/Competitorn/a
Meas. Tech.HDAC Activity screening
IC50 95±n/a nM
Citation Balasubramanian, GKilambi, NRathinasamy, SRajendran, PNarayanan, SRajagopal, S Quinolone-based HDAC inhibitors. J Enzyme Inhib Med Chem29:555-62 (2014) 
 
Histone deacetylase 1/11/4/6/8
Name:Histone deacetylase 1/11/4/6/8
Synonyms:Histone acetylases (HDACs)
Type:Protein
Mol. Mass.:n/a
Description:HeLa nuclear extract
Components:This complex has 5 components.
Component 1
Name:Histone deacetylase 1
Type:Enzyme
Mol. Mass.:55090.27
Organism:Homo sapiens (Human)
Description:Q13547
Residue:482
Component 2
Name:Histone deacetylase 8
Synonyms:HD8 HDAC8_HUMAN Histone deacetylase 8 (HDAC-8) | Human HDAC8
Type:Enzyme
Mol. Mass.:41749.60
Organism:Homo sapiens (Human)
Description:Q9BY41
Residue:377
Component 3
Name:Histone deacetylase 4
Synonyms:Cereblon/Histone deacetylase 4 HDAC4 Histone acetylase 4(HDAC4) KIAA0288
Type:Enzyme
Mol. Mass.:119049.39
Organism:Homo sapiens (Human)
Description:P56524
Residue:1084
Component 4
Name:Histone deacetylase 6
Synonyms:Cereblon/Histone deacetylase 6 HDAC6 Histone deacetylase 6 (HDAC6) KIAA0901 | ORF Names:JM21
Type:Chromatin regulator; hydrolase; repressor
Mol. Mass.:131381.51
Organism:Homo sapiens (Human)
Description:Q9UBN7
Residue:1215
Component 5
Name:Histone deacetylase 11
Synonyms:HD11 HDAC11 | Human HDAC11
Type:Chromatin regulator; hydrolase; repressor
Mol. Mass.:39187.66
Organism:Homo sapiens (Human)
Description:Q96DB2
Residue:347
BDBM65472
NameBDBM65472
Synonyms:Quinolone-based HDAC inhibitor 4w
TypeSmall organic molecule
Emp. Form.C24H22N5O4
Mol. Mass.444.4626
SMILESONC(=O)CCCCn1cc(C(=O)Nc2cc(nn2)-c2ccccc2)c(=O)c2ccccc12