Reaction Details
TargetLeukotriene C4 synthase
LigandBDBM309974
Substrate/Competitorn/a
Meas. Tech.In Vitro hLTC4 Synthase Enzyme Assay
IC50 149±n/a nM
Citation Ronn, RLindh, CJRingberg, EAndersson, HBNilsson, PSchaal, WRMunck af Rosenschöld, MNikitidis, ANikitidis, GJohannesson, PTyrchan, C Compounds and uses US Patent US9657001 Publication Date 5/23/2017
 
Leukotriene C4 synthase
Name:Leukotriene C4 synthase
Type:PROTEIN
Mol. Mass.:16575.59
Organism:Homo sapiens (Human)
Description:ChEMBL_961179
Residue:150
BDBM309974
NameBDBM309974
Synonyms:US9657001, 3
TypeSmall organic molecule
Emp. Form.C22H20ClF3N2O4
Mol. Mass.468.853
SMILESCOc1cc(cnc1C(=O)C1CC1C(O)=O)N(CC1(CC1)C(F)(F)F)c1ccc(Cl)cc1