Reaction Details
TargetLeukotriene C4 synthase
LigandBDBM223258
Substrate/Competitorn/a
Meas. Tech.In Vitro hLTC4 Synthase Enzyme Assay
IC50 185±n/a nM
Citation Ronn, RLindh, CJRingberg, EAndersson, HBNilsson, PSchaal, WRMunck af Rosenschöld, MNikitidis, ANikitidis, GJohannesson, PTyrchan, C Compounds and uses US Patent US9657001 Publication Date 5/23/2017
 
Leukotriene C4 synthase
Name:Leukotriene C4 synthase
Type:PROTEIN
Mol. Mass.:16575.59
Organism:Homo sapiens (Human)
Description:ChEMBL_961179
Residue:150
BDBM223258
NameBDBM223258
Synonyms:2-(5-((Cyclopropylmethyl)(2,3-difluoro-4-methylbenzyl)amino)-3-methoxypicolinoyl)cyclopropanecarboxylic acid US9657001, 33
TypeSmall Organic Molecule
Emp. Form.C23H24F2N2O4
Mol. Mass.430.4445
SMILESCOc1cc(cnc1C(=O)C1CC1C(O)=O)N(CC1CC1)Cc1ccc(C)c(F)c1F