Reaction Details
TargetLeukotriene C4 synthase
LigandBDBM223263
Substrate/Competitorn/a
Meas. Tech.In Vitro hLTC4 Synthase Enzyme Assay
IC50 31.0±n/a nM
Citation Ronn, RLindh, CJRingberg, EAndersson, HBNilsson, PSchaal, WRMunck af Rosenschöld, MNikitidis, ANikitidis, GJohannesson, PTyrchan, C Compounds and uses US Patent US9657001 Publication Date 5/23/2017
 
Leukotriene C4 synthase
Name:Leukotriene C4 synthase
Type:PROTEIN
Mol. Mass.:16575.59
Organism:Homo sapiens (Human)
Description:ChEMBL_961179
Residue:150
BDBM223263
NameBDBM223263
Synonyms:2-(5-((Cyclopropylmethyl)(1,2-dihydroacenaphthylen-3-yl)amino)-3-methoxypicolinoyl)cyclopropanecarboxylic acid US9657001, 38
TypeSmall Organic Molecule
Emp. Form.C27H26N2O4
Mol. Mass.442.5063
SMILESCOc1cc(cnc1C(=O)C1CC1C(O)=O)N(CC1CC1)c1ccc2cccc3CCc1c23